Target
5-hydroxytryptamine receptor 7
Ligand
BDBM50068245
Substrate
Meas. Tech.
ChEMBL_1464331 (CHEMBL3404598)
Ki
5232±n/a nM
Citation
 Smusz, SKurczab, RSatala, GBojarski, AJ Fingerprint-based consensus virtual screening towards structurally new 5-HT(6)R ligands. Bioorg Med Chem Lett 25:1827-30 (2015)  
Target
Name:
5-hydroxytryptamine receptor 7
Synonyms:
5-HT-7 5-HT7 5-HT7S 5HT7 HTR7 | Serotonin receptor 7
Type:
G Protein-Coupled Receptor (GPCR)
Mol. Mass.:
53573.08
Organism:
Homo sapiens (Human)
Description:
P34969
Residue:
479
  
Inhibitor
Name:
BDBM50068245
Synonyms:
CHEMBL1323386
Type:
Small organic molecule
Emp. Form.:
C19H13ClFNO2S
Mol. Mass.:
373.828
SMILES:
Fc1cc(Cl)ccc1CN1c2ccccc2S(=O)(=O)c2ccccc12
: