Target
5-hydroxytryptamine receptor 7
Ligand
BDBM50068248
Substrate
Meas. Tech.
ChEMBL_1464331 (CHEMBL3404598)
Ki
9566±n/a nM
Citation
 Smusz, SKurczab, RSatala, GBojarski, AJ Fingerprint-based consensus virtual screening towards structurally new 5-HT(6)R ligands. Bioorg Med Chem Lett 25:1827-30 (2015)  
Target
Name:
5-hydroxytryptamine receptor 7
Synonyms:
5-HT-7 5-HT7 5-HT7S 5HT7 HTR7 | Serotonin receptor 7
Type:
G Protein-Coupled Receptor (GPCR)
Mol. Mass.:
53573.08
Organism:
Homo sapiens (Human)
Description:
P34969
Residue:
479
  
Inhibitor
Name:
BDBM50068248
Synonyms:
CHEMBL3403341
Type:
Small organic molecule
Emp. Form.:
C22H17ClN2O2S
Mol. Mass.:
408.901
SMILES:
Cc1ccc(Nc2c(cnc3ccc(Cl)cc23)S(=O)(=O)c2ccccc2)cc1
: