Target
Kinesin-like protein KIF11
Ligand
BDBM50068378
Substrate
Meas. Tech.
ChEMBL_1466497 (CHEMBL3406807)
EC50
3313±n/a nM
Citation
 Mansoor, UFAngeles, ARDai, CYang, LVitharana, DBasso, ADGray, KTang, HLiu, MLiang, LAllbritton, OSiddiqui, MA Discovery of novel spiro 1,3,4-thiadiazolines as potent, orally bioavailable and brain penetrant KSP inhibitors. Bioorg Med Chem 23:2424-34 (2015)  
Target
Name:
Kinesin-like protein KIF11
Synonyms:
EG5 KIF11_HUMAN Kinesin Spindle Protein Eg5 TRIP5 | kinesin spindle protein
Type:
PROTEIN
Mol. Mass.:
119138.97
Organism:
Homo sapiens (Human)
Description:
ChEMBL_1457426
Residue:
1056
  
Inhibitor
Name:
BDBM50068378
Synonyms:
CHEMBL3402339
Type:
Small organic molecule
Emp. Form.:
C18H14F2N2OS2
Mol. Mass.:
376.443
SMILES:
CC(=O)N1N=C(SC11CCSc2ccccc12)c1cc(F)ccc1F
: