Target
Kinesin-like protein KIF11
Ligand
BDBM50068400
Substrate
Meas. Tech.
ChEMBL_1466497 (CHEMBL3406807)
EC50
5.0±n/a nM
Citation
 Mansoor, UFAngeles, ARDai, CYang, LVitharana, DBasso, ADGray, KTang, HLiu, MLiang, LAllbritton, OSiddiqui, MA Discovery of novel spiro 1,3,4-thiadiazolines as potent, orally bioavailable and brain penetrant KSP inhibitors. Bioorg Med Chem 23:2424-34 (2015)  
Target
Name:
Kinesin-like protein KIF11
Synonyms:
EG5 KIF11_HUMAN Kinesin Spindle Protein Eg5 TRIP5 | kinesin spindle protein
Type:
PROTEIN
Mol. Mass.:
119138.97
Organism:
Homo sapiens (Human)
Description:
ChEMBL_1457426
Residue:
1056
  
Inhibitor
Name:
BDBM50068400
Synonyms:
CHEMBL3403390
Type:
Small organic molecule
Emp. Form.:
C20H17F4N3O2S
Mol. Mass.:
439.426
SMILES:
CC(=O)N1N=C(S[C@]11[C@H](CCN)COc2c(F)cc(F)cc12)c1cc(F)ccc1F
: