Target
Tyrosine-protein phosphatase non-receptor type 6
Ligand
BDBM50068882
Substrate
Meas. Tech.
ChEMBL_1466567 (CHEMBL3407024)
IC50
15680±n/a nM
Citation
 Chen, JGao, LXGong, JXJiang, CSYao, LGLi, JYLi, JXiao, WGuo, YW Design and synthesis of novel 1,2-dithiolan-4-yl benzoate derivatives as PTP1B inhibitors. Bioorg Med Chem Lett 25:2211-6 (2015)  
Target
Name:
Tyrosine-protein phosphatase non-receptor type 6
Synonyms:
HCP PTP1C Protein tyrosine phosphatase SHP-1 (SHP-1) Protein-tyrosine phosphatase SHP-1 Tyrosine-protein phosphatase non-receptor type 6 | Tyrosine-protein phosphatase non-receptor type 6 (SHP1)
Type:
Protein
Mol. Mass.:
67570.41
Organism:
Homo sapiens (Human)
Description:
P29350
Residue:
595
  
Inhibitor
Name:
BDBM50068882
Synonyms:
CHEMBL3402419
Type:
Small organic molecule
Emp. Form.:
C21H16Br2O4S2
Mol. Mass.:
556.287
SMILES:
Brc1ccc(Br)c(c1)C(=O)OCCC#Cc1ccc(cc1)C(=O)OC1CSSC1
: