Target
Tyrosine-protein phosphatase non-receptor type 11
Ligand
BDBM50068938
Substrate
Meas. Tech.
ChEMBL_1466568 (CHEMBL3407025)
IC50
8910±n/a nM
Citation
 Chen, JGao, LXGong, JXJiang, CSYao, LGLi, JYLi, JXiao, WGuo, YW Design and synthesis of novel 1,2-dithiolan-4-yl benzoate derivatives as PTP1B inhibitors. Bioorg Med Chem Lett 25:2211-6 (2015)  
Target
Name:
Tyrosine-protein phosphatase non-receptor type 11
Synonyms:
3.1.3.48 PTP-1D PTP2C Protein Tyrosine Phosphatase PPN11/Shp2 Protein-Tyrosine Phosphatase SHP-2 Protein-tyrosine phosphatase 2C SH-PTP3 SHP2 Src homology phosphatase 2 (SHP-2) Tyrosine-protein phosphatase non-receptor type 11 (SHP-2) | Tyrosine-protein phosphatase non-receptor type 11 (SHP2)
Type:
Protein phosphatase
Mol. Mass.:
68443.59
Organism:
Homo sapiens (Human)
Description:
Q06124
Residue:
593
  
Inhibitor
Name:
BDBM50068938
Synonyms:
CHEMBL3402408
Type:
Small organic molecule
Emp. Form.:
C23H21FO4S2
Mol. Mass.:
444.539
SMILES:
Fc1cccc(c1)C(=O)OCCCCC#Cc1ccc(cc1)C(=O)OC1CSSC1
: