Target
Tyrosine-protein phosphatase non-receptor type 2
Ligand
BDBM50068879
Substrate
Meas. Tech.
ChEMBL_1466566 (CHEMBL3407023)
IC50
9460±n/a nM
Citation
 Chen, JGao, LXGong, JXJiang, CSYao, LGLi, JYLi, JXiao, WGuo, YW Design and synthesis of novel 1,2-dithiolan-4-yl benzoate derivatives as PTP1B inhibitors. Bioorg Med Chem Lett 25:2211-6 (2015)  
Target
Name:
Tyrosine-protein phosphatase non-receptor type 2
Synonyms:
PTN2_HUMAN PTPT T-cell protein-tyrosine phosphatase TCPTP Tyrosine-protein phosphatase non-receptor type 2 (TC-PTP)
Type:
Protein
Mol. Mass.:
48481.80
Organism:
Homo sapiens (Human)
Description:
P17706
Residue:
415
  
Inhibitor
Name:
BDBM50068879
Synonyms:
CHEMBL3402412
Type:
Small organic molecule
Emp. Form.:
C23H21NO6S2
Mol. Mass.:
471.546
SMILES:
[O-][N+](=O)c1ccc(cc1)C(=O)OCCCCC#Cc1ccc(cc1)C(=O)OC1CSSC1
: