Target
Tyrosine-protein phosphatase non-receptor type 1
Ligand
BDBM50068881
Substrate
Meas. Tech.
ChEMBL_1466565 (CHEMBL3407022)
IC50
2680±n/a nM
Citation
 Chen, JGao, LXGong, JXJiang, CSYao, LGLi, JYLi, JXiao, WGuo, YW Design and synthesis of novel 1,2-dithiolan-4-yl benzoate derivatives as PTP1B inhibitors. Bioorg Med Chem Lett 25:2211-6 (2015)  
Target
Name:
Tyrosine-protein phosphatase non-receptor type 1
Synonyms:
PTN1_HUMAN PTPN1 Protein tyrosine phosphatase-1B (PTP1B) Protein-tyrosine phosphatase 1B (PTP1B) Tyrosine-protein phosphatase non-receptor type 1 (PTP1B)
Type:
Protein phosphatase
Mol. Mass.:
49963.76
Organism:
Homo sapiens (Human)
Description:
Human recombinant GST-fusion PTP1B (1-435).
Residue:
435
  
Inhibitor
Name:
BDBM50068881
Synonyms:
CHEMBL3402418
Type:
Small organic molecule
Emp. Form.:
C23H24Br2O4S2
Mol. Mass.:
588.372
SMILES:
Brc1ccc(Br)c(c1)C(=O)OCCCCCCc1ccc(cc1)C(=O)OC1CSSC1
: