Target
Tyrosine-protein kinase JAK2
Ligand
BDBM50069318
Substrate
Meas. Tech.
ChEMBL_1466708 (CHEMBL3404501)
IC50
71±n/a nM
Citation
 Brasca, MGGnocchi, PNesi, MAmboldi, NAvanzi, NBertrand, JBindi, SCanevari, GCasero, DCiomei, MColombo, NCribioli, SFachin, GFelder, ERGalvani, AIsacchi, AMotto, IPanzeri, ADonati, D Novel pyrrole carboxamide inhibitors of JAK2 as potential treatment of myeloproliferative disorders. Bioorg Med Chem 23:2387-407 (2015)  
Target
Name:
Tyrosine-protein kinase JAK2
Synonyms:
JAK-2 JAK2_HUMAN Janus kinase 2 (JAK2) | Janus kinase 2 (a protein tyrosine kinase)
Type:
Protein
Mol. Mass.:
130684.68
Organism:
Homo sapiens (Human)
Description:
O60674
Residue:
1132
  
Inhibitor
Name:
BDBM50069318
Synonyms:
CHEMBL3403547 | US9688661, 4-(6-Aminopyrimidin-4-yl)-1-[2-chloro-5-(trifluoromethyl)phenyl]-1H-pyrrole-2-carboxamide (compd 242)
Type:
Small organic molecule
Emp. Form.:
C16H11ClF3N5O
Mol. Mass.:
381.74
SMILES:
NC(=O)c1cc(cn1-c1cc(ccc1Cl)C(F)(F)F)-c1cc(N)ncn1
: