Target
Tyrosine-protein kinase JAK2
Ligand
BDBM50069359
Substrate
Meas. Tech.
ChEMBL_1466708 (CHEMBL3404501)
IC50
1068±n/a nM
Citation
 Brasca, MGGnocchi, PNesi, MAmboldi, NAvanzi, NBertrand, JBindi, SCanevari, GCasero, DCiomei, MColombo, NCribioli, SFachin, GFelder, ERGalvani, AIsacchi, AMotto, IPanzeri, ADonati, D Novel pyrrole carboxamide inhibitors of JAK2 as potential treatment of myeloproliferative disorders. Bioorg Med Chem 23:2387-407 (2015)  
Target
Name:
Tyrosine-protein kinase JAK2
Synonyms:
JAK-2 JAK2_HUMAN Janus kinase 2 (JAK2) | Janus kinase 2 (a protein tyrosine kinase)
Type:
Protein
Mol. Mass.:
130684.68
Organism:
Homo sapiens (Human)
Description:
O60674
Residue:
1132
  
Inhibitor
Name:
BDBM50069359
Synonyms:
CHEMBL3402477
Type:
Small organic molecule
Emp. Form.:
C14H12ClN5
Mol. Mass.:
285.732
SMILES:
Cc1ccc(Cl)cc1-c1ncc([nH]1)-c1ccnc(N)n1
: