Target
Sodium- and chloride-dependent GABA transporter 1
Ligand
BDBM50069441
Substrate
Meas. Tech.
ChEMBL_1466784 (CHEMBL3405540)
IC50
>1000000±n/a nM
Citation
 Vogensen, SBJørgensen, LMadsen, KKJurik, ABorkar, NRosatelli, ENielsen, BEcker, GFSchousboe, AClausen, RP Structure activity relationship of selective GABA uptake inhibitors. Bioorg Med Chem 23:2480-8 (2015)  
Target
Name:
Sodium- and chloride-dependent GABA transporter 1
Synonyms:
GABA transporter Gat-1 SC6A1_RAT Solute carrier family 6 member 1
Type:
PROTEIN
Mol. Mass.:
67006.26
Organism:
Rattus norvegicus
Description:
ChEMBL_1472611
Residue:
599
  
Inhibitor
Name:
BDBM50069441
Synonyms:
CHEMBL3403613
Type:
Small organic molecule
Emp. Form.:
C23H29N3O3
Mol. Mass.:
395.4947
SMILES:
[#6]-[#6]-[#7]-1-[#6]-[#6]-[#7](-[#6]-[#6]-[#8]\[#7]=[#6](\c2ccccc2)-c2ccccc2)-[#6]-[#6](-[#6]-1)-[#6](-[#8])=O
: