Target
Tyrosine-protein phosphatase non-receptor type 1
Ligand
BDBM50071370
Substrate
Meas. Tech.
ChEMBL_1466859 (CHEMBL3405965)
IC50
31500±n/a nM
Citation
 Li, JLGao, LXMeng, FWTang, CLZhang, RJLi, JYLuo, CLi, JZhao, WM PTP1B inhibitors from stems of Angelica keiskei (Ashitaba). Bioorg Med Chem Lett 25:2028-32 (2015)  
Target
Name:
Tyrosine-protein phosphatase non-receptor type 1
Synonyms:
PTN1_HUMAN PTPN1 Protein tyrosine phosphatase-1B (PTP1B) Protein-tyrosine phosphatase 1B (PTP1B) Tyrosine-protein phosphatase non-receptor type 1 (PTP1B)
Type:
Protein phosphatase
Mol. Mass.:
49963.76
Organism:
Homo sapiens (Human)
Description:
Human recombinant GST-fusion PTP1B (1-435).
Residue:
435
  
Inhibitor
Name:
BDBM50071370
Synonyms:
(3R,8S)-falcarindiol (3S,8S)-falcarindiol (Z)-(3S,8S)-Heptadeca-1,9-diene-4,6-diyne-3,8-diol Falcarindiol Heptadeca-1,9-diene-4,6-diyne-3,8-diol
Type:
Small organic molecule
Emp. Form.:
C17H24O2
Mol. Mass.:
260.3713
SMILES:
CCCCCCC\C=C/[C@H](O)C#CC#C[C@H](O)C=C
: