Target
Aromatase
Ligand
BDBM50069752
Substrate
Meas. Tech.
ChEMBL_1469291 (CHEMBL3414093)
IC50
980±n/a nM
Citation
 Varela, CLAmaral, CTavares da Silva, ELopes, ACorreia-da-Silva, GCarvalho, RACosta, SCRoleira, FMTeixeira, N Exemestane metabolites: Synthesis, stereochemical elucidation, biochemical activity and anti-proliferative effects in a hormone-dependent breast cancer cell line. Eur J Med Chem 87:336-45 (2014)  
Target
Name:
Aromatase
Synonyms:
ARO1 CP19A_HUMAN CYP19 CYPXIX Cytochrome P450 19A1 Cytochrome P450-C19 (CYP19) FL cytokine receptor precursor | P-450AROM
Type:
Enzyme
Mol. Mass.:
57888.92
Organism:
Homo sapiens (Human)
Description:
P11511
Residue:
503
  
Inhibitor
Name:
BDBM50069752
Synonyms:
CHEMBL3407539
Type:
Small organic molecule
Emp. Form.:
C20H24O3
Mol. Mass.:
312.4028
SMILES:
[H][C@@]12CCC(=O)[C@@]1(C)CC[C@@]1([H])[C@@]2([H])C=C(CO)C2=CC(=O)C=C[C@]12C
: