Target
Protein arginine N-methyltransferase 8
Ligand
BDBM50070953
Substrate
Meas. Tech.
ChEMBL_1468800 (CHEMBL3411810)
IC50
1740±n/a nM
Citation
 Hu, HOwens, EASu, HYan, LLevitz, AZhao, XHenary, MZheng, YG Exploration of cyanine compounds as selective inhibitors of protein arginine methyltransferases: synthesis and biological evaluation. J Med Chem 58:1228-43 (2015)  
Target
Name:
Protein arginine N-methyltransferase 8
Synonyms:
ANM8_HUMAN HRMT1L3 Heterogeneous nuclear ribonucleoprotein methyltransferase-like protein 4 Protein arginine N-methyltransferase 8 Protein arginine methyltransferase 8 (PRMT8)
Type:
Protein
Mol. Mass.:
45293.70
Organism:
Homo sapiens (Human)
Description:
Residue:
394
  
Inhibitor
Name:
BDBM50070953
Synonyms:
CHEMBL3409550
Type:
Small organic molecule
Emp. Form.:
C49H49BrN2
Mol. Mass.:
745.831
SMILES:
[Br-].CC1(C)\C(=C/C=C/C2=[N+](CCCc3ccccc3)c3ccc4ccccc4c3C2(C)C)N(CCCc2ccccc2)c2ccc3ccccc3c12
: