Target
Pantothenate kinase 3
Ligand
BDBM50071548
Substrate
Meas. Tech.
ChEMBL_1469804 (CHEMBL3413798)
EC50
1720±n/a nM
Citation
 Sharma, LKLeonardi, RLin, WBoyd, VAGoktug, AShelat, AAChen, TJackowski, SRock, CO A high-throughput screen reveals new small-molecule activators and inhibitors of pantothenate kinases. J Med Chem 58:1563-8 (2015)  
Target
Name:
Pantothenate kinase 3
Synonyms:
PANK3 Pantothenate kinase 3 hPanK3
Type:
PROTEIN
Mol. Mass.:
41093.59
Organism:
Homo sapiens (Human)
Description:
ChEMBL_109587
Residue:
370
  
Inhibitor
Name:
BDBM50071548
Synonyms:
CHEMBL3410242
Type:
Small organic molecule
Emp. Form.:
C22H25Cl2N3O2
Mol. Mass.:
434.359
SMILES:
CC(N1CCC(CC1)C(=O)NCc1ccccc1)C(=O)Nc1cc(Cl)ccc1Cl
: