Target
N-formyl peptide receptor 2
Ligand
BDBM50050937
Substrate
Meas. Tech.
ChEMBL_1467714 (CHEMBL3411151)
Kd
>300±n/a nM
Citation
 Lacombe, CPiesse, CSagan, SCombadière, CRosenstein, YAuvynet, C Pachymodulin, a new functional formyl peptide receptor 2 peptidic ligand isolated from frog skin has Janus-like immunomodulatory capacities. J Med Chem 58:1089-99 (2015)  
Target
Name:
N-formyl peptide receptor 2
Synonyms:
ALXR, FPRL1, FPR2 FPR2 FPRH1 Formyl Peptide Receptor-Like 1 LXA4 receptor Lipoxin A4 receptor RFP | hFPRL
Type:
G Protein-Coupled Receptor (GPCR)
Mol. Mass.:
38968.35
Organism:
Homo sapiens (Human)
Description:
P25090
Residue:
351
  
Inhibitor
Name:
BDBM50050937
Synonyms:
(S)-2-[(S)-2-((S)-2-Formylamino-4-methylsulfanyl-butyrylamino)-4-methyl-pentanoylamino]-3-phenyl-propionic acid N-formyl-methionyl-leucyl-phenylalanine | N-formylmethionine-leucine-phenylalanine
Type:
Small organic molecule
Emp. Form.:
C21H31N3O5S
Mol. Mass.:
437.553
SMILES:
CSCC[C@H](NC=O)C(=O)N[C@@H](CC(C)C)C(=O)N[C@@H](Cc1ccccc1)C(O)=O
: