Target
Solute carrier organic anion transporter family member 1B3
Ligand
BDBM50001839
Substrate
Meas. Tech.
ChEMBL_1467097 (CHEMBL3411294)
Ki
1800±n/a nM
Citation
 Marada, VVFlörl, SKühne, ABurckhardt, GHagos, Y Interaction of human organic anion transporter polypeptides 1B1 and 1B3 with antineoplastic compounds. Eur J Med Chem 92:723-31 (2015)  
Target
Name:
Solute carrier organic anion transporter family member 1B3
Synonyms:
LST2 OATP8 SLC21A8 SO1B3_HUMAN Solute carrier organic anion transporter family member 1B3 (OATP1B3)
Type:
Protein
Mol. Mass.:
77425.75
Organism:
Homo sapiens (Human)
Description:
Q9NPD5
Residue:
702
  
Inhibitor
Name:
BDBM50001839
Synonyms:
CHEMBL428647 taxol
Type:
Small organic molecule
Emp. Form.:
C47H51NO14
Mol. Mass.:
853.9061
SMILES:
CC(=O)O[C@@H]1C2=C(C)[C@H](C[C@@](O)([C@@H](OC(=O)c3ccccc3)[C@@H]3[C@@]4(CO[C@@H]4C[C@H](O)[C@@]3(C)C1=O)OC(C)=O)C2(C)C)OC(=O)[C@H](O)[C@@H](NC(=O)c1ccccc1)c1ccccc1
: