Target
LIM domain kinase 1
Ligand
BDBM50072672
Substrate
Meas. Tech.
ChEMBL_1467118 (CHEMBL3411315)
IC50
250±n/a nM
Citation
 Yin, YZheng, KEid, NHoward, SJeong, JHYi, FGuo, JPark, CMBibian, MWu, WHernandez, PPark, HWu, YLuo, JLLoGrasso, PVFeng, Y Bis-aryl urea derivatives as potent and selective LIM kinase (Limk) inhibitors. J Med Chem 58:1846-61 (2015)  
Target
Name:
LIM domain kinase 1
Synonyms:
LIM domain kinase 1 LIMK1_RAT Limk1
Type:
PROTEIN
Mol. Mass.:
72598.76
Organism:
Rattus norvegicus
Description:
ChEMBL_109573
Residue:
647
  
Inhibitor
Name:
BDBM50072672
Synonyms:
CHEMBL3410056
Type:
Small organic molecule
Emp. Form.:
C24H23ClFN5O2
Mol. Mass.:
467.923
SMILES:
COCCN(C(=O)Nc1ccc(cc1F)-c1ncnc2[nH]c(C)c(C)c12)c1ccc(Cl)cc1
: