Target
Farnesyl pyrophosphate synthase
Ligand
BDBM25308
Substrate
Meas. Tech.
ChEMBL_1467358 (CHEMBL3411595)
IC50
1.9±n/a nM
Citation
 Gritzalis, DPark, JChiu, WCho, HLin, YSDe Schutter, JWLacbay, CMZielinski, MBerghuis, AMTsantrizos, YS Probing the molecular and structural elements of ligands binding to the active site versus an allosteric pocket of the human farnesyl pyrophosphate synthase. Bioorg Med Chem Lett 25:1117-23 (2015)  
Target
Name:
Farnesyl pyrophosphate synthase
Synonyms:
Dimethylallyltranstransferase FPP synthase FPPS_HUMAN Farnesyl diphosphate synthase Farnesyl diphosphate synthetase Farnesyl pyrophosphate synthetase KIAA1293 | P14324
Type:
Enzyme
Mol. Mass.:
48272.89
Organism:
Homo sapiens (Human)
Description:
P14324
Residue:
419
  
Inhibitor
Name:
BDBM25308
Synonyms:
(1-hydroxy-2-{imidazo[1,2-a]pyridin-3-yl}-1-phosphonoethyl)phosphonic acid | bisphosphonate, 57
Type:
Small organic molecule
Emp. Form.:
C9H12N2O7P2
Mol. Mass.:
322.1483
SMILES:
OC(Cc1cnc2ccccn12)(P(O)(O)=O)P(O)(O)=O
: