Target
Cannabinoid receptor 2
Ligand
BDBM50380889
Substrate
Meas. Tech.
ChEMBL_1468240 (CHEMBL3411783)
Ki
16±n/a nM
Citation
 Han, SZhang, FFQian, HYChen, LLPu, JBXie, XChen, JZ Design, syntheses, structure-activity relationships and docking studies of coumarin derivatives as novel selective ligands for the CB2 receptor. Eur J Med Chem 93:16-32 (2015)  
Target
Name:
Cannabinoid receptor 2
Synonyms:
CANNABINOID CB2 CB2 CB2B CNR2_HUMAN Cannabinoid CB2 receptor Cannabinoid receptor 2 (CB2R) | hCB2
Type:
G Protein-Coupled Receptor (GPCR)
Mol. Mass.:
39690.94
Organism:
Homo sapiens (Human)
Description:
P34972
Residue:
360
  
Inhibitor
Name:
BDBM50380889
Synonyms:
CHEMBL2019086
Type:
Small organic molecule
Emp. Form.:
C26H31FN2O4
Mol. Mass.:
454.5337
SMILES:
OC(=O)C1(CCCCC1)NC(=O)c1cc2CCCCCCc2n(Cc2ccc(F)cc2)c1=O
: