Target
Adenosine kinase
Ligand
BDBM50094703
Substrate
Meas. Tech.
ChEMBL_1467841 (CHEMBL3412566)
IC50
2.0±n/a nM
Citation
 Buron, FMérour, JYAkssira, MGuillaumet, GRoutier, S Recent advances in the chemistry and biology of pyridopyrimidines. Eur J Med Chem 95:76-95 (2015)  
Target
Name:
Adenosine kinase
Synonyms:
ADK | ADK_HUMAN
Type:
PROTEIN
Mol. Mass.:
40545.97
Organism:
Homo sapiens (Human)
Description:
ChEMBL_1467841
Residue:
362
  
Inhibitor
Name:
BDBM50094703
Synonyms:
5-(3-Bromo-phenyl)-7-(6-morpholin-4-yl-pyridin-3-yl)-pyrido[2,3-d]pyrimidin-4-ylamine ABT-702 | CHEMBL66089
Type:
Small organic molecule
Emp. Form.:
C22H19BrN6O
Mol. Mass.:
463.33
SMILES:
Nc1ncnc2nc(cc(-c3cccc(Br)c3)c12)-c1ccc(nc1)N1CCOCC1
: