Target
Falcipain 2
Ligand
BDBM50074129
Substrate
Meas. Tech.
ChEMBL_1468093 (CHEMBL3413866)
Ki
8600±n/a nM
Citation
 Chakka, SKKalamuddin, MSundararaman, SWei, LMundra, SMahesh, RMalhotra, PMohmmed, AKotra, LP Identification of novel class of falcipain-2 inhibitors as potential antimalarial agents. Bioorg Med Chem 23:2221-40 (2015)  
Target
Name:
Falcipain 2
Synonyms:
Cysteine protease falcipain-2 Falcipain-2
Type:
Enzyme
Mol. Mass.:
55912.60
Organism:
Plasmodium falciparum
Description:
Recombinant falcipain-2.
Residue:
484
  
Inhibitor
Name:
BDBM50074129
Synonyms:
CHEMBL3410086
Type:
Small organic molecule
Emp. Form.:
C34H42FN5O6
Mol. Mass.:
635.7256
SMILES:
CC(C)C[C@H](NC(=O)N1CCOCC1)c1nc(co1)C(=O)N[C@@H](Cc1ccccc1)C(=O)N1CCC[C@H]1COc1ccc(F)cc1
: