Target
Falcipain 2
Ligand
BDBM50074146
Substrate
Meas. Tech.
ChEMBL_1468093 (CHEMBL3413866)
Ki
7000±n/a nM
Citation
 Chakka, SKKalamuddin, MSundararaman, SWei, LMundra, SMahesh, RMalhotra, PMohmmed, AKotra, LP Identification of novel class of falcipain-2 inhibitors as potential antimalarial agents. Bioorg Med Chem 23:2221-40 (2015)  
Target
Name:
Falcipain 2
Synonyms:
Cysteine protease falcipain-2 Falcipain-2
Type:
Enzyme
Mol. Mass.:
55912.60
Organism:
Plasmodium falciparum
Description:
Recombinant falcipain-2.
Residue:
484
  
Inhibitor
Name:
BDBM50074146
Synonyms:
CHEMBL3409899
Type:
Small organic molecule
Emp. Form.:
C35H47FN6O6
Mol. Mass.:
666.7827
SMILES:
CC(C)C[C@H](NC(=O)[C@H](CC(C)C)NC(=O)N1CCOCC1)C(=O)N[C@H](C(=O)N1CCN=C1COc1ccc(F)cc1)c1ccccc1
: