Target
Protein arginine N-methyltransferase 3 [N508S]
Ligand
BDBM50427768
Substrate
Meas. Tech.
ChEMBL_1473703 (CHEMBL3421489)
Kd
9500±n/a nM
Citation
 Kaniskan, HÜKonze, KDJin, J Selective inhibitors of protein methyltransferases. J Med Chem 58:1596-629 (2015)  
Target
Name:
Protein arginine N-methyltransferase 3 [N508S]
Synonyms:
ANM3_HUMAN Heterogeneous nuclear ribonucleoprotein methyltransferase-like protein 3 Protein arginine N-methyltransferase 3 | Protein arginine N-methyltransferase 3 (PRMT3)
Type:
Protein
Mol. Mass.:
59859.85
Organism:
Homo sapiens (Human)
Description:
O60678[N508S]
Residue:
531
  
Inhibitor
Name:
BDBM50427768
Synonyms:
CHEMBL2325441
Type:
Small organic molecule
Emp. Form.:
C15H18N4OS
Mol. Mass.:
302.395
SMILES:
O=C(NCCC1=CCCCC1)Nc1ccc2nnsc2c1
: