Target
P2X purinoceptor 7
Ligand
BDBM50075404
Substrate
Meas. Tech.
ChEMBL_1473818 (CHEMBL3418717)
IC50
1620±n/a nM
Citation
 Park, JHLee, GELee, SDHien, TTKim, SYang, JWCho, JHKo, HLim, SCKim, YGKang, KWKim, YC Discovery of novel 2,5-dioxoimidazolidine-based P2X(7) receptor antagonists as constrained analogues of KN62. J Med Chem 58:2114-34 (2015)  
Target
Name:
P2X purinoceptor 7
Synonyms:
ATP receptor P2RX7_HUMAN P2X purinoceptor 7 (P2X7) P2Z receptor | Purinergic receptor
Type:
Protein
Mol. Mass.:
68602.85
Organism:
Homo sapiens (Human)
Description:
Q99572
Residue:
595
  
Inhibitor
Name:
BDBM50075404
Synonyms:
CHEMBL3415326
Type:
Small organic molecule
Emp. Form.:
C31H30N4O5S
Mol. Mass.:
570.659
SMILES:
O=C1NC(=O)N(C1Cc1ccc(OS(=O)(=O)c2cccc3cnccc23)cc1)C1CCN(Cc2ccccc2)CC1
: