Target
Cholinesterase
Ligand
BDBM50075583
Substrate
Meas. Tech.
ChEMBL_1473457 (CHEMBL3419739)
IC50
2632±n/a nM
Citation
 Guzior, NBajda, MSkrok, MKurpiewska, KLewinski, KBrus, BPi?lar, AKos, JGobec, SMalawska, B Development of multifunctional, heterodimeric isoindoline-1,3-dione derivatives as cholinesterase andß-amyloid aggregation inhibitors with neuroprotective properties. Eur J Med Chem 92:738-49 (2015)  
Target
Name:
Cholinesterase
Synonyms:
BCHE CHLE_HORSE | Cholinesterase
Type:
Enzyme
Mol. Mass.:
65643.35
Organism:
Equus caballus (Horse)
Description:
P81908
Residue:
574
  
Inhibitor
Name:
BDBM50075583
Synonyms:
CHEMBL3415580
Type:
Small organic molecule
Emp. Form.:
C22H25ClN2O2
Mol. Mass.:
384.899
SMILES:
Clc1cccc(CNCCCCCCCN2C(=O)c3ccccc3C2=O)c1
: