Target
Acetylcholinesterase
Ligand
BDBM50075583
Substrate
Meas. Tech.
ChEMBL_1473459 (CHEMBL3419741)
IC50
651±n/a nM
Citation
 Guzior, NBajda, MSkrok, MKurpiewska, KLewinski, KBrus, BPi?lar, AKos, JGobec, SMalawska, B Development of multifunctional, heterodimeric isoindoline-1,3-dione derivatives as cholinesterase andß-amyloid aggregation inhibitors with neuroprotective properties. Eur J Med Chem 92:738-49 (2015)  
Target
Name:
Acetylcholinesterase
Synonyms:
ACES_HUMAN Acetylcholinesterase (AChE) | Acetylcholinesterase (human AChE)
Type:
Enzyme
Mol. Mass.:
67792.70
Organism:
Homo sapiens (Human)
Description:
P22303
Residue:
614
  
Inhibitor
Name:
BDBM50075583
Synonyms:
CHEMBL3415580
Type:
Small organic molecule
Emp. Form.:
C22H25ClN2O2
Mol. Mass.:
384.899
SMILES:
Clc1cccc(CNCCCCCCCN2C(=O)c3ccccc3C2=O)c1
: