Target
Sphingosine kinase 1
Ligand
BDBM50443389
Substrate
Meas. Tech.
ChEMBL_1474026 (CHEMBL3419997)
Ki
10000±n/a nM
Citation
 Patwardhan, NNMorris, EAKharel, YRaje, MRGao, MTomsig, JLLynch, KRSantos, WL Structure-activity relationship studies and in vivo activity of guanidine-based sphingosine kinase inhibitors: discovery of SphK1- and SphK2-selective inhibitors. J Med Chem 58:1879-99 (2015)  
Target
Name:
Sphingosine kinase 1
Synonyms:
SK1 SPHK1 SPK Sphingosine kinase 1 (SPHK1) | Sphingosine kinase types 1 (SphK1)
Type:
Enzyme
Mol. Mass.:
42521.16
Organism:
Homo sapiens (Human)
Description:
Q9NYA1
Residue:
384
  
Inhibitor
Name:
BDBM50443389
Synonyms:
CHEMBL2376441
Type:
Small organic molecule
Emp. Form.:
C17H27NO2
Mol. Mass.:
277.4018
SMILES:
CCCCCc1ccc(\C=C\[C@H](O)[C@@H](CO)NC)cc1
: