Target
Sphingosine kinase 1
Ligand
BDBM50443387
Substrate
Meas. Tech.
ChEMBL_1474026 (CHEMBL3419997)
IC50
3600±n/a nM
Citation
 Patwardhan, NNMorris, EAKharel, YRaje, MRGao, MTomsig, JLLynch, KRSantos, WL Structure-activity relationship studies and in vivo activity of guanidine-based sphingosine kinase inhibitors: discovery of SphK1- and SphK2-selective inhibitors. J Med Chem 58:1879-99 (2015)  
Target
Name:
Sphingosine kinase 1
Synonyms:
SK1 SPHK1 SPK Sphingosine kinase 1 (SPHK1) | Sphingosine kinase types 1 (SphK1)
Type:
Enzyme
Mol. Mass.:
42521.16
Organism:
Homo sapiens (Human)
Description:
Q9NYA1
Residue:
384
  
Inhibitor
Name:
BDBM50443387
Synonyms:
CHEMBL3086811
Type:
Small organic molecule
Emp. Form.:
C21H35NO
Mol. Mass.:
317.5087
SMILES:
CCCCCCCCc1ccc(CCN2CCC(O)CC2)cc1
: