Target
Sodium channel protein type 4 subunit alpha
Ligand
BDBM50077469
Substrate
Meas. Tech.
ChEMBL_1473384 (CHEMBL3419344)
IC50
20±n/a nM
Citation
 Murray, JKLigutti, JLiu, DZou, APoppe, LLi, HAndrews, KLMoyer, BDMcDonough, SIFavreau, PStöcklin, RMiranda, LP Engineering potent and selective analogues of GpTx-1, a tarantula venom peptide antagonist of the Na(V)1.7 sodium channel. J Med Chem 58:2299-314 (2015)  
Target
Name:
Sodium channel protein type 4 subunit alpha
Synonyms:
SCN4A SkM1 Sodium channel protein skeletal muscle subunit alpha Sodium channel protein type IV alpha subunit Voltage-gated sodium channel subunit alpha Nav1.4 | Voltage-gated sodium channel subunit alpha Nav1.4 (Nav1.4)
Type:
Protein
Mol. Mass.:
208010.01
Organism:
Homo sapiens (Human)
Description:
P35499
Residue:
1836
  
Inhibitor
Name:
BDBM50077469
Synonyms:
CHEMBL3416888
Type:
Small organic molecule
Emp. Form.:
C71H106N26O23S6
Mol. Mass.:
1884.152
SMILES:
[H][C@]12CSSC[C@]3([H])NC(=O)[C@H](CC(N)=O)NC(=O)[C@]([H])(CSSC[C@H](NC1=O)C(O)=O)NC(=O)[C@@H](N)CSSC[C@]([H])(NC(=O)[C@H](Cc1c[nH]c4ccccc14)NC(=O)[C@H](CCCCN)NC(=O)[C@H](CO)NC(=O)[C@H](CO)NC3=O)C(=O)N[C@@H](CCCNC(N)=C)C(=O)N[C@@H](CC(O)=O)C(=O)N[C@@H](Cc1cnc[nH]1)C(=O)N[C@@H](CO)C(=O)N[C@@H](CCCNC(N)=N)C(=O)N2
: