Target
Sodium channel protein type 4 subunit alpha
Ligand
BDBM50051073
Substrate
Meas. Tech.
ChEMBL_1473384 (CHEMBL3419344)
IC50
30±n/a nM
Citation
 Murray, JKLigutti, JLiu, DZou, APoppe, LLi, HAndrews, KLMoyer, BDMcDonough, SIFavreau, PStöcklin, RMiranda, LP Engineering potent and selective analogues of GpTx-1, a tarantula venom peptide antagonist of the Na(V)1.7 sodium channel. J Med Chem 58:2299-314 (2015)  
Target
Name:
Sodium channel protein type 4 subunit alpha
Synonyms:
SCN4A SkM1 Sodium channel protein skeletal muscle subunit alpha Sodium channel protein type IV alpha subunit Voltage-gated sodium channel subunit alpha Nav1.4 | Voltage-gated sodium channel subunit alpha Nav1.4 (Nav1.4)
Type:
Protein
Mol. Mass.:
208010.01
Organism:
Homo sapiens (Human)
Description:
P35499
Residue:
1836
  
Inhibitor
Name:
BDBM50051073
Synonyms:
CHEMBL3318132
Type:
Small organic molecule
Emp. Form.:
C168H250N46O41S8
Mol. Mass.:
3826.586
SMILES:
[H][C@]12CSSC[C@]3([H])NC(=O)[C@@]([H])(NC(=O)[C@H](Cc4c[nH]c5ccccc45)NC(=O)[C@H](CCSC)NC(=O)[C@H](Cc4c[nH]c5ccccc45)NC(=O)[C@H](CCCCN)NC(=O)[C@H](CCC(N)=O)NC(=O)[C@H](CSSC[C@]([H])(NC(=O)[C@]([H])(CSSC[C@H](NC(=O)[C@H](Cc4c[nH]c5ccccc45)NC(=O)[C@H](CC(C)C)NC(=O)[C@H](CCCNC(N)=N)NC1=O)C(=O)N[C@@H](CCCCN)C(=O)N[C@@H](CCCCN)C(=O)N[C@@H](CCCCN)C(=O)N[C@@H](CC(C)C)C(=O)N[C@@H](Cc1c[nH]c4ccccc14)C(O)=O)NC(=O)[C@H](CCCCN)NC(=O)[C@H](CCCNC(N)=N)NC(=O)[C@H](CCC(O)=O)NC(=O)[C@H](CO)NC(=O)[C@H](CC(O)=O)NC3=O)C(=O)N[C@@H](CCC(O)=O)C(=O)NCC(=O)N[C@@H](CCSC)C(=O)N[C@@H](C(C)C)C(=O)N2)NC(=O)[C@@H](N)Cc1ccc(O)cc1)[C@@H](C)O
: