Target
Histone deacetylase 1
Ligand
BDBM50078747
Substrate
Meas. Tech.
ChEMBL_1471541 (CHEMBL3420276)
IC50
6020±n/a nM
Citation
 Lin, XChen, WQiu, ZGuo, LZhu, WLi, WWang, ZZhang, WZhang, ZRong, YZhang, MYu, LZhong, SZhao, RWu, XWong, JCTang, G Design and synthesis of orally bioavailable aminopyrrolidinone histone deacetylase 6 inhibitors. J Med Chem 58:2809-20 (2015)  
Target
Name:
Histone deacetylase 1
Synonyms:
Cereblon/Histone deacetylase 1 HDAC1 Histone deacetylase 1 (HDAC1) RPD3L1
Type:
Enzyme
Mol. Mass.:
55090.27
Organism:
Homo sapiens (Human)
Description:
Q13547
Residue:
482
  
Inhibitor
Name:
BDBM50078747
Synonyms:
CHEMBL3415628
Type:
Small organic molecule
Emp. Form.:
C21H20N4O3
Mol. Mass.:
376.4085
SMILES:
CC1(CCN(C1=O)c1ccc2ncccc2c1)Nc1ccc(cc1)C(=O)NO
: