Target
Histone deacetylase 6
Ligand
BDBM19149
Substrate
Meas. Tech.
ChEMBL_1471542 (CHEMBL3420277)
IC50
54±n/a nM
Citation
 Lin, XChen, WQiu, ZGuo, LZhu, WLi, WWang, ZZhang, WZhang, ZRong, YZhang, MYu, LZhong, SZhao, RWu, XWong, JCTang, G Design and synthesis of orally bioavailable aminopyrrolidinone histone deacetylase 6 inhibitors. J Med Chem 58:2809-20 (2015)  
Target
Name:
Histone deacetylase 6
Synonyms:
Cereblon/Histone deacetylase 6 HDAC6 Histone deacetylase 6 (HDAC6) KIAA0901 | ORF Names:JM21
Type:
Chromatin regulator; hydrolase; repressor
Mol. Mass.:
131381.51
Organism:
Homo sapiens (Human)
Description:
Q9UBN7
Residue:
1215
  
Inhibitor
Name:
BDBM19149
Synonyms:
CHEMBL98 SAHA US10188756, Compound SAHA US11505523, Compound SAHA US9353061, SAHA US9695181, Vorinostat Zolinza suberoylanilide hydroxamic acid
Type:
Small organic molecule
Emp. Form.:
C14H20N2O3
Mol. Mass.:
264.3202
SMILES:
ONC(=O)CCCCCCC(=O)Nc1ccccc1
: