Target
Histone deacetylase 6
Ligand
BDBM50078681
Substrate
Meas. Tech.
ChEMBL_1471542 (CHEMBL3420277)
IC50
360±n/a nM
Citation
 Lin, XChen, WQiu, ZGuo, LZhu, WLi, WWang, ZZhang, WZhang, ZRong, YZhang, MYu, LZhong, SZhao, RWu, XWong, JCTang, G Design and synthesis of orally bioavailable aminopyrrolidinone histone deacetylase 6 inhibitors. J Med Chem 58:2809-20 (2015)  
Target
Name:
Histone deacetylase 6
Synonyms:
Cereblon/Histone deacetylase 6 HDAC6 Histone deacetylase 6 (HDAC6) KIAA0901 | ORF Names:JM21
Type:
Chromatin regulator; hydrolase; repressor
Mol. Mass.:
131381.51
Organism:
Homo sapiens (Human)
Description:
Q9UBN7
Residue:
1215
  
Inhibitor
Name:
BDBM50078681
Synonyms:
CHEMBL3415456
Type:
Small organic molecule
Emp. Form.:
C17H16ClN3O3
Mol. Mass.:
345.78
SMILES:
ONC(=O)c1ccc(NC2CCN(C2=O)c2ccccc2Cl)cc1
: