Target
Histone deacetylase 8
Ligand
BDBM50078692
Substrate
Meas. Tech.
ChEMBL_1471609 (CHEMBL3420550)
IC50
860±n/a nM
Citation
 Lin, XChen, WQiu, ZGuo, LZhu, WLi, WWang, ZZhang, WZhang, ZRong, YZhang, MYu, LZhong, SZhao, RWu, XWong, JCTang, G Design and synthesis of orally bioavailable aminopyrrolidinone histone deacetylase 6 inhibitors. J Med Chem 58:2809-20 (2015)  
Target
Name:
Histone deacetylase 8
Synonyms:
HD8 HDAC8_HUMAN Histone deacetylase 8 (HDAC-8) | Human HDAC8
Type:
Enzyme
Mol. Mass.:
41749.60
Organism:
Homo sapiens (Human)
Description:
Q9BY41
Residue:
377
  
Inhibitor
Name:
BDBM50078692
Synonyms:
CHEMBL3415625
Type:
Small organic molecule
Emp. Form.:
C17H18ClN3O2
Mol. Mass.:
331.797
SMILES:
ONC(=O)c1ccc(NC2CCN(C2)c2ccc(Cl)cc2)cc1
: