Target
Histone deacetylase 8
Ligand
BDBM50078749
Substrate
Meas. Tech.
ChEMBL_1471609 (CHEMBL3420550)
IC50
590±n/a nM
Citation
 Lin, XChen, WQiu, ZGuo, LZhu, WLi, WWang, ZZhang, WZhang, ZRong, YZhang, MYu, LZhong, SZhao, RWu, XWong, JCTang, G Design and synthesis of orally bioavailable aminopyrrolidinone histone deacetylase 6 inhibitors. J Med Chem 58:2809-20 (2015)  
Target
Name:
Histone deacetylase 8
Synonyms:
HD8 HDAC8_HUMAN Histone deacetylase 8 (HDAC-8) | Human HDAC8
Type:
Enzyme
Mol. Mass.:
41749.60
Organism:
Homo sapiens (Human)
Description:
Q9BY41
Residue:
377
  
Inhibitor
Name:
BDBM50078749
Synonyms:
CHEMBL3415630
Type:
Small organic molecule
Emp. Form.:
C18H18ClN3O3
Mol. Mass.:
359.807
SMILES:
C[C@]1(CCN(C1=O)c1ccc(Cl)cc1)Nc1ccc(cc1)C(=O)NO
: