Target
Serine/threonine-protein kinase PLK4
Ligand
BDBM50073587
Substrate
Meas. Tech.
ChEMBL_1470617 (CHEMBL3420030)
EC50
12±n/a nM
Citation
 Yu, BYu, ZQi, PPYu, DQLiu, HM Discovery of orally active anticancer candidate CFI-400945 derived from biologically promising spirooxindoles: success and challenges. Eur J Med Chem 95:35-40 (2015)  
Target
Name:
Serine/threonine-protein kinase PLK4
Synonyms:
PLK4 Polo-Like Kinase 4 STK18 | Serine/threonine-protein kinase PLK4
Type:
PROTEIN
Mol. Mass.:
108996.91
Organism:
Homo sapiens (Human)
Description:
ChEMBL_1474078
Residue:
970
  
Inhibitor
Name:
BDBM50073587
Synonyms:
CHEMBL3408947 US20230365537, Example CFI-400495 | US9907800, Example A185
Type:
Small organic molecule
Emp. Form.:
C33H34N4O3
Mol. Mass.:
534.6481
SMILES:
COc1ccc2NC(=O)[C@@]3(C[C@H]3c3ccc4c(\C=C\c5ccc(CN6C[C@H](C)O[C@H](C)C6)cc5)n[nH]c4c3)c2c1
: