Target
Glycine receptor subunit alpha-1
Ligand
BDBM50340481
Substrate
Meas. Tech.
ChEMBL_1474520 (CHEMBL3423809)
EC50
330±n/a nM
Citation
 Wells, MMTillman, TSMowrey, DDSun, TXu, YTang, P Ensemble-based virtual screening for cannabinoid-like potentiators of the human glycine receptora1 for the treatment of pain. J Med Chem 58:2958-66 (2015)  
Target
Name:
Glycine receptor subunit alpha-1
Synonyms:
GLRA1 Glycine receptor 48 kDa subunit | Glycine receptor strychnine-binding subunit
Type:
Enzyme Catalytic Domain
Mol. Mass.:
52635.39
Organism:
Homo sapiens (Human)
Description:
P23415
Residue:
457
  
Inhibitor
Name:
BDBM50340481
Synonyms:
Avodart DUTASTERIDE GI-198745
Type:
Small organic molecule
Emp. Form.:
C27H30F6N2O2
Mol. Mass.:
528.5297
SMILES:
C[C@]12CC[C@H]3[C@@H](CC[C@H]4NC(=O)C=C[C@]34C)[C@@H]1CC[C@@H]2C(=O)Nc1cc(ccc1C(F)(F)F)C(F)(F)F
: