Target
D(1A) dopamine receptor
Ligand
BDBM50083510
Substrate
Meas. Tech.
ChEMBL_1474464 (CHEMBL3423753)
Kd
30000±n/a nM
Citation
 Molero, AVendrell, MBonaventura, JZachmann, JLópez, LPardo, LLluis, CCortés, AAlbericio, FCasadó, VRoyo, M A solid-phase combinatorial approach for indoloquinolizidine-peptides with high affinity at D(1) and D(2) dopamine receptors. Eur J Med Chem 97:173-80 (2015)  
Target
Name:
D(1A) dopamine receptor
Synonyms:
DA D1 receptor DRD1 Dopamine D1 receptor Dopamine D1A
Type:
Enzyme
Mol. Mass.:
49303.43
Organism:
Homo sapiens (Human)
Description:
P21728
Residue:
446
  
Inhibitor
Name:
BDBM50083510
Synonyms:
CHEMBL3423411
Type:
Small organic molecule
Emp. Form.:
C42H56F2N8O5
Mol. Mass.:
790.9414
SMILES:
[H][C@@]12CC[C@H](CN1CCc1c2[nH]c2ccccc12)C(=O)NCCCCCC(=O)N1CCC[C@@H]1C(=O)N[C@@H](Cc1ccc(F)c(F)c1)C(=O)N[C@@H](CCCCN)C(N)=O
: