Target
Prostaglandin G/H synthase 1
Ligand
BDBM50153040
Substrate
Meas. Tech.
ChEMBL_1476666 (CHEMBL3428751)
IC50
500±n/a nM
Citation
 Perrone, MGVitale, PPanella, AFortuna, CGScilimati, A General role of the amino and methylsulfamoyl groups in selective cyclooxygenase(COX)-1 inhibition by 1,4-diaryl-1,2,3-triazoles and validation of a predictive pharmacometric PLS model. Eur J Med Chem 94:252-64 (2015)  
Target
Name:
Prostaglandin G/H synthase 1
Synonyms:
COX-1 Cyclooxygenase Cyclooxygenase-1 (COX-1) PTGS1 | Prostaglandin G/H synthase (cyclooxygenase)
Type:
Enzyme
Mol. Mass.:
68692.62
Organism:
Homo sapiens (Human)
Description:
P23219
Residue:
599
  
Inhibitor
Name:
BDBM50153040
Synonyms:
3-(5-Chloro-furan-2-yl)-5-methyl-4-phenyl-isoxazole | CHEMBL363228
Type:
Small organic molecule
Emp. Form.:
C14H10ClNO2
Mol. Mass.:
259.688
SMILES:
Cc1onc(-c2ccc(Cl)o2)c1-c1ccccc1
: