Target
Prostaglandin G/H synthase 2
Ligand
BDBM50376383
Substrate
Meas. Tech.
ChEMBL_1476660 (CHEMBL3428745)
IC50
440±n/a nM
Citation
 Perrone, MGVitale, PPanella, AFortuna, CGScilimati, A General role of the amino and methylsulfamoyl groups in selective cyclooxygenase(COX)-1 inhibition by 1,4-diaryl-1,2,3-triazoles and validation of a predictive pharmacometric PLS model. Eur J Med Chem 94:252-64 (2015)  
Target
Name:
Prostaglandin G/H synthase 2
Synonyms:
COX2 Cyclooxygenase-2 (COX-2) PTGS2 Prostaglandin G/H synthase (cyclooxygenase)
Type:
Protein
Mol. Mass.:
68976.98
Organism:
Ovis aries (Sheep)
Description:
Residue:
603
  
Inhibitor
Name:
BDBM50376383
Synonyms:
CHEMBL259972
Type:
Small organic molecule
Emp. Form.:
C19H17NO5
Mol. Mass.:
339.342
SMILES:
COc1ccc(cc1)-c1noc(CC(O)=O)c1-c1ccc(OC)cc1
: