Target
Prostaglandin G/H synthase 1
Ligand
BDBM13065
Substrate
Meas. Tech.
ChEMBL_1476659 (CHEMBL3428744)
IC50
7.0±n/a nM
Citation
 Perrone, MGVitale, PPanella, AFortuna, CGScilimati, A General role of the amino and methylsulfamoyl groups in selective cyclooxygenase(COX)-1 inhibition by 1,4-diaryl-1,2,3-triazoles and validation of a predictive pharmacometric PLS model. Eur J Med Chem 94:252-64 (2015)  
Target
Name:
Prostaglandin G/H synthase 1
Synonyms:
COX1 Cyclooxygenase-1 (COX-1) PTGS1 | Prostaglandin G/H synthase (cyclooxygenase)
Type:
Protein
Mol. Mass.:
68868.60
Organism:
Ovis aries (Sheep)
Description:
Residue:
600
  
Inhibitor
Name:
BDBM13065
Synonyms:
5-(4-chlorophenyl)-1-(4-methoxyphenyl)-3-(trifluoromethyl)-1H-pyrazole SC-560
Type:
Small organic molecule
Emp. Form.:
C17H12ClF3N2O
Mol. Mass.:
352.738
SMILES:
COc1ccc(cc1)-n1nc(cc1-c1ccc(Cl)cc1)C(F)(F)F
: