Target
Patatin-like phospholipase domain-containing protein 2
Ligand
BDBM50084766
Substrate
Meas. Tech.
ChEMBL_1476694 (CHEMBL3428915)
IC50
>200000±n/a nM
Citation
 Mayer, NSchweiger, MMelcher, MCFledelius, CZechner, RZimmermann, RBreinbauer, R Structure-activity studies in the development of a hydrazone based inhibitor of adipose-triglyceride lipase (ATGL). Bioorg Med Chem 23:2904-16 (2015)  
Target
Name:
Patatin-like phospholipase domain-containing protein 2
Synonyms:
Adipose triglyceride lipase Desnutrin Patatin-like phospholipase domain-containing protein 2 | Pnpla2
Type:
PROTEIN
Mol. Mass.:
53655.79
Organism:
Mus musculus
Description:
ChEMBL_109612
Residue:
486
  
Inhibitor
Name:
BDBM50084766
Synonyms:
CHEMBL3427328
Type:
Small organic molecule
Emp. Form.:
C20H25N3O3
Mol. Mass.:
355.4308
SMILES:
COc1cc(OC)c(\C=N\N2CCN(CC2)c2ccccc2)cc1OC
: