Target
Estrogen receptor
Ligand
BDBM50041611
Substrate
Meas. Tech.
ChEMBL_1476879 (CHEMBL3429913)
IC50
>100000±n/a nM
Citation
 Degorce, SLBailey, ACallis, RDe Savi, CDucray, RLamont, GMacFaul, PMaudet, MMartin, SMorgentin, RNorman, RAPeru, APink, JHPlé, PARoberts, BScott, JS Investigation of (E)-3-[4-(2-Oxo-3-aryl-chromen-4-yl)oxyphenyl]acrylic Acids as Oral Selective Estrogen Receptor Down-Regulators. J Med Chem 58:3522-33 (2015)  
Target
Name:
Estrogen receptor
Synonyms:
ER ESR ESR1_HUMAN Estrogen receptor Estrogen receptor (ER-alpha) Estrogen receptor alpha (ER) Nuclear receptor subfamily 3 group A member 1
Type:
Protein
Mol. Mass.:
66230.44
Organism:
Homo sapiens (Human)
Description:
P03372
Residue:
595
  
Inhibitor
Name:
BDBM50041611
Synonyms:
(2E)-3-{4-[(1E)-1,2-DIPHENYLBUT-1-ENYL]PHENYL}ACRYLIC ACID CHEMBL33899
Type:
Small organic molecule
Emp. Form.:
C25H22O2
Mol. Mass.:
354.441
SMILES:
CC\C(=C(/c1ccccc1)c1ccc(\C=C\C(O)=O)cc1)c1ccccc1
: