Target
Transient receptor potential cation channel subfamily V member 1
Ligand
BDBM50086740
Substrate
Meas. Tech.
ChEMBL_1477335 (CHEMBL3429301)
IC50
2.8±n/a nM
Citation
 Parsons, WHCalvo, RRCheung, WLee, YKPatel, SLiu, JYoungman, MADax, SLStone, DQin, NHutchinson, TLubin, MLZhang, SPFinley, MLiu, YBrandt, MRFlores, CMPlayer, MR Benzo[d]imidazole Transient Receptor Potential Vanilloid 1 Antagonists for the Treatment of Pain: Discovery of trans-2-(2-{2-[2-(4-Trifluoromethyl-phenyl)-vinyl]-1H-benzimidazol-5-yl}-phenyl)-propan-2-ol (Mavatrep). J Med Chem 58:3859-74 (2015)  
Target
Name:
Transient receptor potential cation channel subfamily V member 1
Synonyms:
Capsaicin receptor Osm-9-like TRP channel 1 TRPV1_HUMAN Transient receptor potential cation channel subfamily V member 1 (TRPV1) Transient receptor potential cation channel subfamily V member 1(TRPV1) Vanilloid VR1 Vanilloid receptor 1 Vanilloid receptor 1 (VRI/TRPV1)
Type:
Protein
Mol. Mass.:
94960.75
Organism:
Homo sapiens (Human)
Description:
Q8NER1
Residue:
839
  
Inhibitor
Name:
BDBM50086740
Synonyms:
CHEMBL3426378
Type:
Small organic molecule
Emp. Form.:
C24H20N2O
Mol. Mass.:
352.4284
SMILES:
CC(C)(O)c1ccccc1-c1ccc2[nH]c(nc2c1)C#Cc1ccccc1
: