Target
Rho-associated protein kinase 2
Ligand
BDBM50087122
Substrate
Meas. Tech.
ChEMBL_1478011 (CHEMBL3429819)
IC50
<1.000000±n/a nM
Citation
 Boland, SBourin, AAlen, JGeraets, JSchroeders, PCastermans, KKindt, NBoumans, NPanitti, LFransen, SVanormelingen, JStassen, JMLeysen, DDefert, O Design, synthesis, and biological evaluation of novel, highly active soft ROCK inhibitors. J Med Chem 58:4309-24 (2015)  
Target
Name:
Rho-associated protein kinase 2
Synonyms:
KIAA0619 ROCK2 Rho kinase 2 (ROCKII) Rho-associated protein kinase 2 (ROCK2) Rho-associated protein kinase 2/Transforming protein RhoA Rho-associated, coiled-coil-containing protein kinase II p164 ROCK-2
Type:
Protein
Mol. Mass.:
160885.43
Organism:
Homo sapiens (Human)
Description:
O75116
Residue:
1388
  
Inhibitor
Name:
BDBM50087122
Synonyms:
CHEMBL3426647
Type:
Small organic molecule
Emp. Form.:
C31H29FN4O4
Mol. Mass.:
540.5848
SMILES:
CC(C)OC(=O)Cc1ccc(NC(=O)c2cccc(c2)-c2cc(ccc2CN)C(=O)Nc2ccncc2F)cc1
: