Target
Rho-associated protein kinase 2
Ligand
BDBM50087126
Substrate
Meas. Tech.
ChEMBL_1478011 (CHEMBL3429819)
IC50
<1.000000±n/a nM
Citation
 Boland, SBourin, AAlen, JGeraets, JSchroeders, PCastermans, KKindt, NBoumans, NPanitti, LFransen, SVanormelingen, JStassen, JMLeysen, DDefert, O Design, synthesis, and biological evaluation of novel, highly active soft ROCK inhibitors. J Med Chem 58:4309-24 (2015)  
Target
Name:
Rho-associated protein kinase 2
Synonyms:
KIAA0619 ROCK2 Rho kinase 2 (ROCKII) Rho-associated protein kinase 2 (ROCK2) Rho-associated protein kinase 2/Transforming protein RhoA Rho-associated, coiled-coil-containing protein kinase II p164 ROCK-2
Type:
Protein
Mol. Mass.:
160885.43
Organism:
Homo sapiens (Human)
Description:
O75116
Residue:
1388
  
Inhibitor
Name:
BDBM50087126
Synonyms:
CHEMBL3426639
Type:
Small organic molecule
Emp. Form.:
C28H22F2N4O4
Mol. Mass.:
516.4955
SMILES:
COC(=O)c1ccc(F)c(c1)C(=O)Nc1cccc(c1)-c1cc(ccc1CN)C(=O)Nc1ccncc1F
: