Target
Sodium channel protein type 7 subunit alpha
Ligand
BDBM50031720
Substrate
Meas. Tech.
ChEMBL_1478677 (CHEMBL3430578)
IC50
300000±n/a nM
Citation
 Mirams, GRCui, YSher, AFink, MCooper, JHeath, BMMcMahon, NCGavaghan, DJNoble, D Simulation of multiple ion channel block provides improved early prediction of compounds' clinical torsadogenic risk. Cardiovasc Res 91:53-61 (2011)  
Target
Name:
Sodium channel protein type 7 subunit alpha
Synonyms:
Putative voltage-gated sodium channel subunit alpha Nax SCN7A Sodium channel protein cardiac and skeletal muscle subunit alpha Sodium channel protein type VII subunit alpha
Type:
PROTEIN
Mol. Mass.:
193514.99
Organism:
Homo sapiens (Human)
Description:
ChEMBL_105639
Residue:
1682
  
Inhibitor
Name:
BDBM50031720
Synonyms:
(Dofetilide) N-[4-(2-{[2-(4-Methanesulfonylamino-phenyl)-ethyl]-methylamino}-ethoxy)-phenyl]-methanesulfonamide DOFETILIDE N-[4-(2-{[2-(4-Methanesulfonylamino-phenyl)-ethyl]-methyl-amino}-ethoxy)-phenyl]-methanesulfonamide (UK-68798) N-[4-(2-{[2-(4-methanesulfonylamino-phenoxy)-ethyl]-methyl-amino}-ethyl)-phenyl]-methanesulfonamide UK-68,798 | US10167299, Dofetilide
Type:
Small organic molecule
Emp. Form.:
C19H27N3O5S2
Mol. Mass.:
441.565
SMILES:
CN(CCOc1ccc(NS(C)(=O)=O)cc1)CCc1ccc(NS(C)(=O)=O)cc1
: