Target
UDP-glucuronosyltransferase 1A8
Ligand
BDBM50088502
Substrate
Meas. Tech.
ChEMBL_1489265 (CHEMBL3533108)
Ki
22600±n/a nM
Citation
 Maul, RSiegl, DKulling, SE Glucuronidation of the red clover isoflavone irilone by liver microsomes from different species and human UDP-glucuronosyltransferases. Drug Metab Dispos 39:610-6 (2011)  
Target
Name:
UDP-glucuronosyltransferase 1A8
Synonyms:
GNT1 UD18_HUMAN UDP-glucuronosyltransferase 1-H UDPGT 1-8 UGT1 UGT1-08 UGT1A8 | UGT1H
Type:
PROTEIN
Mol. Mass.:
59751.98
Organism:
Homo sapiens (Human)
Description:
ChEMBL_104086
Residue:
530
  
Inhibitor
Name:
BDBM50088502
Synonyms:
CHEBI:5970 | CHEMBL3527329
Type:
Small organic molecule
Emp. Form.:
C16H10O6
Mol. Mass.:
298.247
SMILES:
Oc1ccc(cc1)-c1coc2cc3OCOc3c(O)c2c1=O
: