Target
Solute carrier organic anion transporter family member 1B1
Ligand
BDBM50248106
Substrate
Meas. Tech.
ChEMBL_1490912 (CHEMBL3533582)
Ki
14900±n/a nM
Citation
 Takeuchi, KSugiura, TUmeda, SMatsubara, KHorikawa, MNakamichi, NSilver, DLIshiwata, NKato, Y Pharmacokinetics and hepatic uptake of eltrombopag, a novel platelet-increasing agent. Drug Metab Dispos 39:1088-96 (2011)  
Target
Name:
Solute carrier organic anion transporter family member 1B1
Synonyms:
LST1 OATP2 SLC21A6 SO1B1_HUMAN Solute carrier organic anion transporter family member 1B1 (OATP1B1) | Thromboxane B2
Type:
Protein
Mol. Mass.:
76468.06
Organism:
Homo sapiens (Human)
Description:
Q9Y6L6
Residue:
691
  
Inhibitor
Name:
BDBM50248106
Synonyms:
CHEMBL461101 Eltrombopag olamine
Type:
Small organic molecule
Emp. Form.:
C25H22N4O4
Mol. Mass.:
442.4666
SMILES:
Cc1[nH]n(-c2ccc(C)c(C)c2)c(=O)c1N=Nc1cccc(-c2cccc(c2)C(O)=O)c1O
: